mavenFailed to execute goal org.apache.maven.plugins:maven-s

mavenFailed to execute goal org.apache.maven.plugins:maven-surefire-plugin解决办法
[INFO] example.domain .................................... FAILURE [0.500s]
[INFO] example.dao ....................................... SKIPPED
[INFO] example.service ................................... SKIPPED
[INFO] example.web Maven Webapp .......................... SKIPPED
[INFO] ------------------------------------------------------------------------
[INFO] BUILD FAILURE
[INFO] ------------------------------------------------------------------------
[INFO] Total time: 0.843s
[INFO] Finished at: Tue Jul 31 14:50:43 CST 2012
[INFO] Final Memory: 4M/8M
[INFO] ------------------------------------------------------------------------
[ERROR] Failed to execute goal org.apache.maven.plugins:maven-surefire-plugin:2.10:test (default-test) on project example.domain: Unable to generate classpath: org.apache.maven.artifact.resolver.MultipleArtifactsNotFoundException: Missing:
[ERROR] ----------
[ERROR] 1) org.apache.maven.surefire:surefire-junit3:jar:2.10
[ERROR]
[ERROR] Try downloading the file manually from the project website.
[ERROR]
[ERROR] Then, install it using the command:
[ERROR] mvn install:install-file -DgroupId=org.apache.maven.surefire -DartifactId=surefire-junit3 -Dversion=2.10 -Dpackaging=jar -Dfile=/path/to/file
[ERROR]
[ERROR] Alternatively, if you host your own repository you can deploy the file there:
[ERROR] mvn deploy:deploy-file -DgroupId=org.apache.maven.surefire -DartifactId=surefire-junit3 -Dversion=2.10 -Dpackaging=jar -Dfile=/path/to/file -Durl=[url] -DrepositoryId=[id]
[ERROR]
[ERROR] Path to dependency:
[ERROR] 1) dummy:dummy:jar:1.0
[ERROR] 2) org.apache.maven.surefire:surefire-junit3:jar:2.10
[ERROR]
[ERROR] ----------
[ERROR] 1 required artifact is missing.
[ERROR]
[ERROR] for artifact:
[ERROR] dummy:dummy:jar:1.0
[ERROR] -> [Help 1]
[ERROR]
[ERROR] To see the full stack trace of the errors, re-run Maven with the -e switch.
[ERROR] Re-run Maven using the -X switch to enable full debug logging.
[ERROR]
[ERROR] For more information about the errors and possible solutions, please read the following articles:
[ERROR] [Help 1] http://cwiki.apache.org/confluence/display/MAVEN/MojoExecutionException
[ERROR]
[ERROR] After correcting the problems, you can resume the build with the command
[ERROR]   mvn <goals> -rf :example.domain
当运行项目时,报这个错,但是相关的包又引入进来了,我的解决办法时:
    当我直接运行时,不需要maven的调试,所以直接跳过调试,就可以了,具体的办法是:在Run Configurations的选项下的Maven Builde新建一个,Goals:tomcat:run,并选中Skip Tests,然后run就可以了
赞 (0) 评论 分享 ()